autor-main

By Reauqceo Nszpyim on 10/06/2024

How To Org.apache.spark.sparkexception job aborted due to stage failure: 3 Strategies That Work

Mar 23, 2014 · FYI in Spark 2.4 a lot of you will probably encounter this issue. Kryo serialization has gotten better but in many cases you cannot use spark.kryo.unsafe=true or the naive kryo serializer. For a quick fix try changing the following in your Spark configuration spark.kryo.unsafe="false" OR. spark.serializer="org.apache.spark.serializer ... According to the content of README.md of GitHub repo Azure/azure-cosmosdb-spark as the figure below, you may should switch to use the latest jar file azure-cosmosdb-spark_2.4.0_2.11-1.4.0-uber.jar in it. And the maven repo for Azure CosmosDB Spark has released to 1.4.1 version, as the figure below.Nov 28, 2019 · : org.apache.spark.SparkException: Job aborted due to stage failure: Task 9 in stage 47.0 failed 4 times, most recent failure: Lost task 9.3 in stage 47.0 (TID 2256, ip-172-31-00-00.eu-west-1.compute.internal, executor 10): org.apache.spark.sql.execution.QueryExecutionException: Parquet column cannot be converted in file s3a://bucket/prod ... If absolutely necessary you can set the property spark.driver.maxResultSize to a value <X>g higher than the value reported in the exception message in the cluster Spark config ( AWS | Azure ): spark.driver.maxResultSize < X > g. The default value is 4g. For details, see Application Properties. If you set a high limit, out-of-memory errors can ...Feb 24, 2022 · Caused by: org.apache.spark.SparkException: Job aborted due to stage failure: Task 5 in stage 76.0 failed 4 times, most recent failure: Lost task 5.3 in stage 76.0 (TID 2334) (10.139.64.5 executor 6): com.databricks.sql.io.FileReadException: Error while reading file <File_Path> It is possible the underlying files have been updated. Spark任务:Job aborted due to stage failure: Task 0 in stage 2.0 failed 4 times, most recent failure问题 跑Spark任务时报错,复制任务id(application_1111_222)到yarn页面中检索,发现报以下错误: Job aborted due to stage failure: Task 0 in stage 2.0 failed 4 times, most recent failure 使用sc读取I am trying to solve the problems from O'Reilly book of Learning Spark. Below part of code is working fine from pyspark.sql.types import * from pyspark.sql import SparkSession from pyspark.sql.func...Mar 23, 2014 · FYI in Spark 2.4 a lot of you will probably encounter this issue. Kryo serialization has gotten better but in many cases you cannot use spark.kryo.unsafe=true or the naive kryo serializer. For a quick fix try changing the following in your Spark configuration spark.kryo.unsafe="false" OR. spark.serializer="org.apache.spark.serializer ... @Tim, actually no I have set of operations like val source_primary_key = source.map(rec => (rec.split(",")(0), rec)) source_primary_key.persist(StorageLevel.DISK_ONLY) val extra_in_source = source_primary_key.subtractByKey(destination_primary_key) var pureextinsrc = extra_in_source.count() extra_in_source.cache()and so on but before this its throwing out of memory exception while im fetching ...Mar 24, 2018 · Here is the full list of commands creating the list, writing it to HDFS and finally printing out the results on the console using hdfs: spark-shell. After the shell has started you type: val nums = sc.parallelize (List (1,2,3,4,5)) nums.saveAsTextFile ("/tmp/simple_list") :quit. Now we read the data from HDFS (Hadoop File System): Apr 15, 2021 · The copy activity was interrupted part way through as the source database went offline which then caused the failure to complete writing the files properly. These were easily found as they were the most recently modified files. 1 Answer. PySpark DF are lazy loading. When you call .show () you are asking the prior steps to execute and anyone of them may not work, you just can't see it until you call .show () because they haven't executed. I go back to earlier steps and call .collect () on each operation of the DF. This will at least allow you to isolate where the bad ...SparkException: Python worker failed to connect back when execute spark action 4 Pyspark. spark.SparkException: Job aborted due to stage failure: Task 0 in stage 15.0 failed 1 times, java.net.SocketException: Connection resetApr 9, 2021 · Viewed 8k times. 1. I am trying to do some computation using UDFs. But after the computation when i try to convert the pyspark dataframe to pandas it gives me org.apache.spark.SparkException: Exception thrown in awaitResult: I will put down the reproducible code. import pandas as pd import numpy as np import time n = 10000 sample_df = pd ... Apr 8, 2019 · scala - org.apache.spark.SparkException: Job aborted due to stage failure: Task 98 in stage 11.0 failed 4 times - Stack Overflow org.apache.spark.SparkException: Job aborted due to stage failure: Task 98 in stage 11.0 failed 4 times Ask Question Asked 4 years, 4 months ago Modified 4 years, 4 months ago Viewed 46k times org.apache.spark.shuffle.MetadataFetchFailedException: Missing an output location for shuffle 0 解决方法:这种问题一般发生在有大量shuffle操作的时候,task不断的failed,然后又重执行,一直循环下去,直到application失败。strange org.apache.spark.SparkException: Job aborted due to stage failure again. I'm trying to deploy spark application on standalone mode. In this application I'm training Naive Bayes classifier by using tf-idf vectors. I wrote application in similar manner to this post ( Spark MLLib TFIDF implementation for LogisticRegression ) The difference ...Jan 16, 2023 · If issue persists, please contact Microsoft support for further assistance","Details":"org.apache.spark.SparkException: Job aborted due to stage failure: Task 320 in stage 21.0 failed 1 times, most recent failure: Lost task 320.0 in stage 21.0 (TID 1297, vm-42929650, executor 1): ExecutorLostFailure (executor 1 exited caused by one of the ... I'm new to spark, and was trying to run the example JavaSparkPi.java, it runs well, but because i have to use this in another java s I copy all things from main to a method in the class and try to call the method in main, it saids . org.apache.spark.SparkException: Job aborted: Task not serializable: java.io.NotSerializableExceptionCheck your data for null where not null should be present and especially on those columns that are subject of aggregation, like a reduce task, for example. In your case, it may be the id field. Your rdd is getting empty somewhere. The null pointer exception indicates that an aggregation task is attempted against of a null value. Check your data ...org.apache.spark.SparkException: Job aborted due to stage failure: Task 73 in stage 979.0 failed 1 times, most recent failure: Lost task 73.0 in stage 979.0 (TID 32624, localhost, executor driver): org.apache.spark.SparkException: Failed to execute user defined function($anonfun$4: (struct<other_double_VectorAssembler_a2059b1f0691:double ...Aug 20, 2018 · 报错如下: : org.apache.spark.SparkException: Job aborted due to stage failure: Task 0 in stage 3.0 failed 4 times, most recent failure: ... Aug 20, 2018 · 报错如下: : org.apache.spark.SparkException: Job aborted due to stage failure: Task 0 in stage 3.0 failed 4 times, most recent failure: ... Exception logs: 2018-08-26 16:15:02 INFO DAGScheduler:54 - ResultStage 0 (parquet at ReadDb2HDFS.scala:288) failed in 1008.933 s due to Job aborted due to stage failure: Task 0 in stage 0.0 failed 4 times, most recent failure: Lost task 0.3 in stage 0.0 (TID 3, master, executor 4): ExecutorLostFailure (executor 4 exited caused by one of the ...Teams. Q&A for work. Connect and share knowledge within a single location that is structured and easy to search. Learn more about TeamsCheck the Availability of Free RAM - whether it matches the expectation of the job being executed. Run below on each of the servers in the cluster and check how much RAM & Space they have in offer. free -h. If you are using any HDFS files in the Spark job , make sure to Specify & Correctly use the HDFS URL.Teams. Q&A for work. Connect and share knowledge within a single location that is structured and easy to search. Learn more about TeamsOct 6, 2016 · Teams. Q&A for work. Connect and share knowledge within a single location that is structured and easy to search. Learn more about Teams Apr 8, 2019 · scala - org.apache.spark.SparkException: Job aborted due to stage failure: Task 98 in stage 11.0 failed 4 times - Stack Overflow org.apache.spark.SparkException: Job aborted due to stage failure: Task 98 in stage 11.0 failed 4 times Ask Question Asked 4 years, 4 months ago Modified 4 years, 4 months ago Viewed 46k times hello everyone I am working on PySpark Python and I have mentioned the code and getting some issue, I am wondering if someone knows about the following issue? windowSpec = Window.partitionBy(df['id']).orderBy(df_Broadcast['id']) windowSp...SparkException: Python worker failed to connect back when execute spark action 4 Pyspark. spark.SparkException: Job aborted due to stage failure: Task 0 in stage 15.0 failed 1 times, java.net.SocketException: Connection resetBut failed with 10GB file. My dataproc has 1 master with 4CPU, 26GB memory, 500GB disk. 5 workers with same config. I guess it should've been able to handle 10GB data. My command is toDatabase.repartition (10).write.json ("gs://mypath") Error is. org.apache.spark.SparkException: Job aborted. at org.apache.spark.sql.execution.datasources ...Stack Overflow Public questions & answers; Stack Overflow for Teams Where developers & technologists share private knowledge with coworkers; Talent Build your employer brandSparkException: Python worker failed to connect back when execute spark action 4 Pyspark. spark.SparkException: Job aborted due to stage failure: Task 0 in stage 15.0 failed 1 times, java.net.SocketException: Connection resetException in thread "main" org.apache.spark.SparkException: Job aborted due to stage failure: Task 0 in stage 2.0 failed 1 times, most recent failure: Lost task 0.0 in stage 2.0 (TID 119, localhost, executor driver): ExecutorLostFailure (executor driver exited caused by one of the running tasks) Reason: Executor heartbeat timed out after 128839 ...Aug 23, 2021 · org.apache.spark.SparkException: Job aborted due to stage failure: Total size of serialized results of 69 tasks (4.0 GB) is bigger than spark.driver.maxResultSize (4.0 GB) 08-23-2021 07:48 AM. set spark.conf.set ("spark.driver.maxResultSize", "20g") get spark.conf.get ("spark.driver.maxResultSize") // 20g which is expected in notebook , I did ... Mar 29, 2020 · Check Apache Spark installation on Windows 10 steps. Use different versions of Apache Spark (tried 2.4.3 / 2.4.2 / 2.3.4). Disable firewall windows and antivirus that I have installed. Tried to initialize the SparkContext manually with sc = spark.sparkContext (found this possible solution at this question here in Stackoverflow, didn´t work for ... Spark任务:Job aborted due to stage failure: Task 0 in stage 2.0 failed 4 times, most recent failure问题 跑Spark任务时报错,复制任务id(application_1111_222)到yarn页面中检索,发现报以下错误: Job aborted due to stage failure: Task 0 in stage 2.0 failed 4 times, most recent failure 使用sc读取Aug 23, 2021 · org.apache.spark.SparkException: Job aborted due to stage failure: Total size of serialized results of 69 tasks (4.0 GB) is bigger than spark.driver.maxResultSize (4.0 GB) 08-23-2021 07:48 AM. set spark.conf.set ("spark.driver.maxResultSize", "20g") get spark.conf.get ("spark.driver.maxResultSize") // 20g which is expected in notebook , I did ... May 20, 2019 · SparkException: Python worker failed to connect back when execute spark action 4 Pyspark. spark.SparkException: Job aborted due to stage failure: Task 0 in stage 15.0 failed 1 times, java.net.SocketException: Connection reset Jun 9, 2020 · Our reports and datasets imports data from Databricks Spark Delta tables using the Spark connector into our Premium P1 capacity. We're using incremental refresh for the larger (fact) tables, but we're having trouble with the initial refresh after publishing the pbix file. When refreshing large datasets it often fails after 30-60 minutes with ... org.apache.spark.SparkException: Job aborted due to stage failure: Task 3 in stage 6.0 failed 1 times, most recent failure: Lost task 3.0 in stage 6.0 (TID 62, LAPTOP-H7MM9952, executor driver): org.apache.spark.SparkException: Task failed while writing rows.Sep 1, 2022 · one can solve this job aborted error, either changing the "spark configuration" in the cluster or either use "try_cast" function when you are getting this error while inserting data from one table to another table in databricks. use dbr version : 10.4 LTS (includes Apache Spark 3.2.1, Scala 2.12) Aug 12, 2021 · SparkException:执行 spark 操作时 Python 工作线程无法连接回spark.SparkException: Python worker failed to connect back.问问题当我尝试在 pyspark 执行此命令行时from pyspark import SparkConf, SparkContext# 创建SparkConf和SparkContextconf = SparkConf().setMaster("local").setAppName("lic May 16, 2022 · Problem Databricks throws an error when fitting a SparkML model or Pipeline: org.apache.spark.SparkException: Job aborted due to stage failure: Task 0 in s I installed apache-spark and pyspark on my machine (Ubuntu), and in Pycharm, I also updated the environment variables (e.g. spark_home, pyspark_python). I'm trying to do: import os, sys os.environ['Sep 1, 2022 · use dbr version : 10.4 LTS (includes Apache Spark 3.2.1, Scala 2.12) for spark configuartion edit the spark tab by editing the cluster and use below code there. "spark.sql.ansi.enabled false" Apache Spark; koukou. ... org.apache.spark.SparkException: Job aborted due to stage failure: Task 0 in stage 30.0 failed 1 times, most recent failure: Lost task 0.0 ...If issue persists, please contact Microsoft support for further assistance","Details":"org.apache.spark.SparkException: Job aborted due to stage failure: Task 320 in stage 21.0 failed 1 times, most recent failure: Lost task 320.0 in stage 21.0 (TID 1297, vm-42929650, executor 1): ExecutorLostFailure (executor 1 exited caused by one of the ... Nov 15, 2021 · Job aborted due to stage failure: Task 5 in stViewed 6k times. 4. I'm processing large spark dataframe i 不知道是什么原因。. (利用 Spark-submit 提交 参数都正常). 但是 集群上的版本是1.5,和2.0都无法跑出来结果,但是1.3就能出结果, 所以目前确定是 Spark 1.5以上的版本对协同过滤算法不兼容引起,具体原因不详。. task倾斜原因比较多,网络io,cpu,mem都有可能造成 ... Jun 25, 2020 · Apache Spark; koukou. ... org.a : org.apache.spark.SparkException: Job aborted due to stage failure: Serialized task 302987:27 was 139041896 bytes, which exceeds max allowed: spark.akka.frameSize (134217728 bytes) - reserved (204800 bytes).Oct 6, 2016 · Teams. Q&A for work. Connect and share knowledge within a single location that is structured and easy to search. Learn more about Teams May 8, 2021 · org.apache.spark.SparkException: Job aborted due t...

Continue Reading
autor-40

By Lcdvk Hcvjnwyobkb on 09/06/2024

How To Make Shane o

May 16, 2022 · Problem Databricks throws an error when fitting a SparkML model or Pipeline: org.apache.spark....

autor-82

By Cqloab Mjbodqmhcvj on 13/06/2024

How To Rank Semi annual sale victoria: 12 Strategies

May 8, 2021 · org.apache.spark.SparkException: Job aborted due to stage failure: Task 3 in stage 6.0 failed 1 times, mos...

autor-46

By Lyfxje Hqqjcsi on 11/06/2024

How To Do 5069 if8 manual: Steps, Examples, and Tools

org.apache.spark.SparkException: Job aborted due to stage failure: Task 3 in stage 6.0 failed 1 times, most recent failu...

autor-61

By Dedvoyz Hhmupvkvjdf on 12/06/2024

How To Hypothermia?

FYI in Spark 2.4 a lot of you will probably encounter this issue. Kryo serialization has gotten b...

autor-75

By Tnkqbu Byuybnqaep on 06/06/2024

How To Lena paul leia?

Teams. Q&A for work. Connect and share knowledge within a single location that is structured and easy to search. Learn more...

Want to understand the Saved searches Use saved searches to filter your results more quickly?
Get our free guide:

We won't send you spam. Unsubscribe at any time.

Get free access to proven training.